org.apache.spark.repl.ReplSuite should clone and clean line object in ClosureCleaner

Latest runs

Build Status Start time Duration Executor Revision Logs
spark-branch-2.1-test-maven-hadoop-2.3 #664 PASSED 2017-12-08 17:25:03 3552 ms amp-jenkins-worker-03 0f6862106682304742d1144ddcbae9a15d40b51e
spark-branch-2.1-test-maven-hadoop-2.3 #664 PASSED 2017-12-08 17:25:03 3552 ms amp-jenkins-worker-03 0f6862106682304742d1144ddcbae9a15d40b51e
spark-branch-2.1-test-maven-hadoop-2.3 #664 PASSED 2017-12-08 17:25:03 3552 ms amp-jenkins-worker-03 0f6862106682304742d1144ddcbae9a15d40b51e
spark-branch-2.1-test-sbt-hadoop-2.7 #648 PASSED 2017-12-08 14:09:27 4119 ms amp-jenkins-worker-04 0f6862106682304742d1144ddcbae9a15d40b51e
spark-branch-2.1-test-sbt-hadoop-2.7 #648 PASSED 2017-12-08 14:09:27 4119 ms amp-jenkins-worker-04 0f6862106682304742d1144ddcbae9a15d40b51e
spark-branch-2.1-test-sbt-hadoop-2.7 #648 PASSED 2017-12-08 14:09:27 4119 ms amp-jenkins-worker-04 0f6862106682304742d1144ddcbae9a15d40b51e
spark-branch-2.1-test-sbt-hadoop-2.2 #643 PASSED 2017-12-08 03:36:13 6013 ms amp-jenkins-worker-07 0f6862106682304742d1144ddcbae9a15d40b51e
spark-branch-2.1-test-sbt-hadoop-2.2 #643 PASSED 2017-12-08 03:36:13 6013 ms amp-jenkins-worker-07 0f6862106682304742d1144ddcbae9a15d40b51e
spark-branch-2.1-test-sbt-hadoop-2.2 #643 PASSED 2017-12-08 03:36:13 6013 ms amp-jenkins-worker-07 0f6862106682304742d1144ddcbae9a15d40b51e
spark-branch-2.1-test-sbt-hadoop-2.4 #629 PASSED 2017-12-08 03:36:13 9563 ms amp-jenkins-worker-05 0f6862106682304742d1144ddcbae9a15d40b51e
spark-branch-2.1-test-sbt-hadoop-2.4 #629 PASSED 2017-12-08 03:36:13 9563 ms amp-jenkins-worker-05 0f6862106682304742d1144ddcbae9a15d40b51e
spark-branch-2.1-test-sbt-hadoop-2.4 #629 PASSED 2017-12-08 03:36:13 9563 ms amp-jenkins-worker-05 0f6862106682304742d1144ddcbae9a15d40b51e
spark-branch-2.1-test-maven-hadoop-2.2 #665 PASSED 2017-12-08 03:34:13 7295 ms amp-jenkins-worker-07 0f6862106682304742d1144ddcbae9a15d40b51e
spark-branch-2.1-test-maven-hadoop-2.2 #665 PASSED 2017-12-08 03:34:13 7295 ms amp-jenkins-worker-07 0f6862106682304742d1144ddcbae9a15d40b51e
spark-branch-2.1-test-maven-hadoop-2.2 #665 PASSED 2017-12-08 03:34:13 7295 ms amp-jenkins-worker-07 0f6862106682304742d1144ddcbae9a15d40b51e
spark-branch-2.1-test-maven-hadoop-2.6 #660 PASSED 2017-12-08 03:33:13 8687 ms amp-jenkins-worker-04 0f6862106682304742d1144ddcbae9a15d40b51e
spark-branch-2.1-test-maven-hadoop-2.6 #660 PASSED 2017-12-08 03:33:13 8687 ms amp-jenkins-worker-04 0f6862106682304742d1144ddcbae9a15d40b51e
spark-branch-2.1-test-maven-hadoop-2.6 #660 PASSED 2017-12-08 03:33:13 8687 ms amp-jenkins-worker-04 0f6862106682304742d1144ddcbae9a15d40b51e
spark-branch-2.1-test-sbt-hadoop-2.3 #636 PASSED 2017-12-08 03:33:13 3769 ms amp-jenkins-worker-08 0f6862106682304742d1144ddcbae9a15d40b51e
spark-branch-2.1-test-sbt-hadoop-2.3 #636 PASSED 2017-12-08 03:33:13 3769 ms amp-jenkins-worker-08 0f6862106682304742d1144ddcbae9a15d40b51e
spark-branch-2.1-test-sbt-hadoop-2.3 #636 PASSED 2017-12-08 03:33:13 3769 ms amp-jenkins-worker-08 0f6862106682304742d1144ddcbae9a15d40b51e
spark-branch-2.1-test-maven-hadoop-2.4 #661 PASSED 2017-12-08 03:32:18 4768 ms amp-jenkins-worker-05 0f6862106682304742d1144ddcbae9a15d40b51e
spark-branch-2.1-test-maven-hadoop-2.4 #661 PASSED 2017-12-08 03:32:18 4768 ms amp-jenkins-worker-05 0f6862106682304742d1144ddcbae9a15d40b51e
spark-branch-2.1-test-maven-hadoop-2.4 #661 PASSED 2017-12-08 03:32:18 4768 ms amp-jenkins-worker-05 0f6862106682304742d1144ddcbae9a15d40b51e
spark-branch-2.1-test-maven-hadoop-2.7 #658 PASSED 2017-12-08 03:32:18 4511 ms amp-jenkins-worker-07 0f6862106682304742d1144ddcbae9a15d40b51e
spark-branch-2.1-test-maven-hadoop-2.7 #658 PASSED 2017-12-08 03:32:18 4511 ms amp-jenkins-worker-07 0f6862106682304742d1144ddcbae9a15d40b51e
spark-branch-2.1-test-maven-hadoop-2.7 #658 PASSED 2017-12-08 03:32:18 4511 ms amp-jenkins-worker-07 0f6862106682304742d1144ddcbae9a15d40b51e
spark-branch-2.1-test-sbt-hadoop-2.6 #649 PASSED 2017-12-08 03:32:18 4912 ms amp-jenkins-worker-08 0f6862106682304742d1144ddcbae9a15d40b51e
spark-branch-2.1-test-sbt-hadoop-2.6 #649 PASSED 2017-12-08 03:32:18 4912 ms amp-jenkins-worker-08 0f6862106682304742d1144ddcbae9a15d40b51e
spark-branch-2.1-test-sbt-hadoop-2.6 #649 PASSED 2017-12-08 03:32:18 4912 ms amp-jenkins-worker-08 0f6862106682304742d1144ddcbae9a15d40b51e
spark-branch-2.1-test-sbt-hadoop-2.6 #648 PASSED 2017-12-05 17:06:13 4538 ms amp-jenkins-worker-08 768b34a2e4538690360a13f5be3577af28ff8e00
spark-branch-2.1-test-sbt-hadoop-2.6 #648 PASSED 2017-12-05 17:06:13 4538 ms amp-jenkins-worker-08 768b34a2e4538690360a13f5be3577af28ff8e00
spark-branch-2.1-test-sbt-hadoop-2.6 #648 PASSED 2017-12-05 17:06:13 4538 ms amp-jenkins-worker-08 768b34a2e4538690360a13f5be3577af28ff8e00
spark-branch-2.1-test-maven-hadoop-2.4 #660 PASSED 2017-12-02 15:42:15 9196 ms amp-jenkins-worker-06 768b34a2e4538690360a13f5be3577af28ff8e00
spark-branch-2.1-test-maven-hadoop-2.4 #660 PASSED 2017-12-02 15:42:15 9196 ms amp-jenkins-worker-06 768b34a2e4538690360a13f5be3577af28ff8e00
spark-branch-2.1-test-maven-hadoop-2.4 #660 PASSED 2017-12-02 15:42:15 9196 ms amp-jenkins-worker-06 768b34a2e4538690360a13f5be3577af28ff8e00
spark-branch-2.1-test-maven-hadoop-2.7 #657 PASSED 2017-12-02 15:42:15 12329 ms amp-jenkins-worker-07 768b34a2e4538690360a13f5be3577af28ff8e00
spark-branch-2.1-test-maven-hadoop-2.7 #657 PASSED 2017-12-02 15:42:15 12329 ms amp-jenkins-worker-07 768b34a2e4538690360a13f5be3577af28ff8e00
spark-branch-2.1-test-maven-hadoop-2.7 #657 PASSED 2017-12-02 15:42:15 12329 ms amp-jenkins-worker-07 768b34a2e4538690360a13f5be3577af28ff8e00
spark-branch-2.1-test-sbt-hadoop-2.6 #647 PASSED 2017-12-02 15:42:15 3444 ms amp-jenkins-worker-07 768b34a2e4538690360a13f5be3577af28ff8e00
spark-branch-2.1-test-sbt-hadoop-2.6 #647 PASSED 2017-12-02 15:42:15 3444 ms amp-jenkins-worker-07 768b34a2e4538690360a13f5be3577af28ff8e00
spark-branch-2.1-test-sbt-hadoop-2.6 #647 PASSED 2017-12-02 15:42:15 3444 ms amp-jenkins-worker-07 768b34a2e4538690360a13f5be3577af28ff8e00
spark-branch-2.1-test-sbt-hadoop-2.7 #646 PASSED 2017-12-02 15:42:15 4103 ms amp-jenkins-worker-04 768b34a2e4538690360a13f5be3577af28ff8e00
spark-branch-2.1-test-sbt-hadoop-2.7 #646 PASSED 2017-12-02 15:42:15 4103 ms amp-jenkins-worker-04 768b34a2e4538690360a13f5be3577af28ff8e00
spark-branch-2.1-test-sbt-hadoop-2.7 #646 PASSED 2017-12-02 15:42:15 4103 ms amp-jenkins-worker-04 768b34a2e4538690360a13f5be3577af28ff8e00
spark-branch-2.1-test-sbt-hadoop-2.2 #642 PASSED 2017-12-02 15:41:10 4249 ms amp-jenkins-worker-03 768b34a2e4538690360a13f5be3577af28ff8e00
spark-branch-2.1-test-sbt-hadoop-2.2 #642 PASSED 2017-12-02 15:41:10 4249 ms amp-jenkins-worker-03 768b34a2e4538690360a13f5be3577af28ff8e00
spark-branch-2.1-test-sbt-hadoop-2.2 #642 PASSED 2017-12-02 15:41:10 4249 ms amp-jenkins-worker-03 768b34a2e4538690360a13f5be3577af28ff8e00
spark-branch-2.1-test-sbt-hadoop-2.4 #628 PASSED 2017-12-02 15:41:10 3682 ms amp-jenkins-worker-08 768b34a2e4538690360a13f5be3577af28ff8e00
spark-branch-2.1-test-sbt-hadoop-2.4 #628 PASSED 2017-12-02 15:41:10 3682 ms amp-jenkins-worker-08 768b34a2e4538690360a13f5be3577af28ff8e00
spark-branch-2.1-test-sbt-hadoop-2.4 #628 PASSED 2017-12-02 15:41:10 3682 ms amp-jenkins-worker-08 768b34a2e4538690360a13f5be3577af28ff8e00
spark-branch-2.1-test-maven-hadoop-2.2 #664 PASSED 2017-12-02 15:39:10 6686 ms amp-jenkins-worker-05 768b34a2e4538690360a13f5be3577af28ff8e00
spark-branch-2.1-test-maven-hadoop-2.2 #664 PASSED 2017-12-02 15:39:10 6686 ms amp-jenkins-worker-05 768b34a2e4538690360a13f5be3577af28ff8e00
spark-branch-2.1-test-maven-hadoop-2.2 #664 PASSED 2017-12-02 15:39:10 6686 ms amp-jenkins-worker-05 768b34a2e4538690360a13f5be3577af28ff8e00
spark-branch-2.1-test-maven-hadoop-2.3 #661 PASSED 2017-12-02 15:38:10 4294 ms amp-jenkins-worker-06 768b34a2e4538690360a13f5be3577af28ff8e00
spark-branch-2.1-test-maven-hadoop-2.3 #661 PASSED 2017-12-02 15:38:10 4294 ms amp-jenkins-worker-06 768b34a2e4538690360a13f5be3577af28ff8e00
spark-branch-2.1-test-maven-hadoop-2.3 #661 PASSED 2017-12-02 15:38:10 4294 ms amp-jenkins-worker-06 768b34a2e4538690360a13f5be3577af28ff8e00
spark-branch-2.1-test-maven-hadoop-2.6 #659 PASSED 2017-12-02 15:38:10 9991 ms amp-jenkins-worker-08 768b34a2e4538690360a13f5be3577af28ff8e00
spark-branch-2.1-test-maven-hadoop-2.6 #659 PASSED 2017-12-02 15:38:10 9991 ms amp-jenkins-worker-08 768b34a2e4538690360a13f5be3577af28ff8e00
spark-branch-2.1-test-maven-hadoop-2.6 #659 PASSED 2017-12-02 15:38:10 9991 ms amp-jenkins-worker-08 768b34a2e4538690360a13f5be3577af28ff8e00
spark-branch-2.1-test-sbt-hadoop-2.3 #635 PASSED 2017-12-02 15:38:10 3564 ms amp-jenkins-worker-02 768b34a2e4538690360a13f5be3577af28ff8e00
spark-branch-2.1-test-sbt-hadoop-2.3 #635 PASSED 2017-12-02 15:38:10 3564 ms amp-jenkins-worker-02 768b34a2e4538690360a13f5be3577af28ff8e00
spark-branch-2.1-test-sbt-hadoop-2.3 #635 PASSED 2017-12-02 15:38:10 3564 ms amp-jenkins-worker-02 768b34a2e4538690360a13f5be3577af28ff8e00
spark-branch-2.1-test-maven-hadoop-2.3 #660 PASSED 2017-12-01 01:28:14 4479 ms amp-jenkins-worker-06 4e3680f221868d7fcca23e1aafea20b80465b79b
spark-branch-2.1-test-maven-hadoop-2.3 #660 PASSED 2017-12-01 01:28:14 4479 ms amp-jenkins-worker-06 4e3680f221868d7fcca23e1aafea20b80465b79b
spark-branch-2.1-test-maven-hadoop-2.3 #660 PASSED 2017-12-01 01:28:14 4479 ms amp-jenkins-worker-06 4e3680f221868d7fcca23e1aafea20b80465b79b
spark-branch-2.1-test-maven-hadoop-2.6 #658 PASSED 2017-12-01 01:28:14 8051 ms amp-jenkins-worker-07 4e3680f221868d7fcca23e1aafea20b80465b79b
spark-branch-2.1-test-maven-hadoop-2.6 #658 PASSED 2017-12-01 01:28:14 8051 ms amp-jenkins-worker-07 4e3680f221868d7fcca23e1aafea20b80465b79b
spark-branch-2.1-test-maven-hadoop-2.6 #658 PASSED 2017-12-01 01:28:14 8051 ms amp-jenkins-worker-07 4e3680f221868d7fcca23e1aafea20b80465b79b
spark-branch-2.1-test-maven-hadoop-2.4 #659 PASSED 2017-12-01 01:27:14 7298 ms amp-jenkins-worker-04 4e3680f221868d7fcca23e1aafea20b80465b79b
spark-branch-2.1-test-maven-hadoop-2.4 #659 PASSED 2017-12-01 01:27:14 7298 ms amp-jenkins-worker-04 4e3680f221868d7fcca23e1aafea20b80465b79b
spark-branch-2.1-test-maven-hadoop-2.4 #659 PASSED 2017-12-01 01:27:14 7298 ms amp-jenkins-worker-04 4e3680f221868d7fcca23e1aafea20b80465b79b
spark-branch-2.1-test-maven-hadoop-2.7 #656 PASSED 2017-12-01 01:27:14 13576 ms amp-jenkins-worker-02 4e3680f221868d7fcca23e1aafea20b80465b79b
spark-branch-2.1-test-maven-hadoop-2.7 #656 PASSED 2017-12-01 01:27:14 13576 ms amp-jenkins-worker-02 4e3680f221868d7fcca23e1aafea20b80465b79b
spark-branch-2.1-test-maven-hadoop-2.7 #656 PASSED 2017-12-01 01:27:14 13576 ms amp-jenkins-worker-02 4e3680f221868d7fcca23e1aafea20b80465b79b
spark-branch-2.1-test-maven-hadoop-2.6 #657 PASSED 2017-11-24 14:10:02 11329 ms amp-jenkins-worker-08 a02a8bd2395368b603c5080a88f2d238bdc62cd8
spark-branch-2.1-test-maven-hadoop-2.6 #657 PASSED 2017-11-24 14:10:02 11329 ms amp-jenkins-worker-08 a02a8bd2395368b603c5080a88f2d238bdc62cd8
spark-branch-2.1-test-maven-hadoop-2.6 #657 PASSED 2017-11-24 14:10:02 11329 ms amp-jenkins-worker-08 a02a8bd2395368b603c5080a88f2d238bdc62cd8
spark-branch-2.0-test-maven-hadoop-2.4 #1048 PASSED 2017-10-31 09:30:17 8032 ms amp-jenkins-worker-06 076c2f6a199974a3e30fe349cfc45f375007f081
spark-branch-2.0-test-maven-hadoop-2.4 #1048 PASSED 2017-10-31 09:30:17 8032 ms amp-jenkins-worker-06 076c2f6a199974a3e30fe349cfc45f375007f081
spark-branch-2.0-test-maven-hadoop-2.4 #1048 PASSED 2017-10-31 09:30:17 8032 ms amp-jenkins-worker-06 076c2f6a199974a3e30fe349cfc45f375007f081
spark-branch-2.0-test-maven-hadoop-2.2 #1048 PASSED 2017-10-31 04:50:16 9248 ms amp-jenkins-worker-04 076c2f6a199974a3e30fe349cfc45f375007f081
spark-branch-2.0-test-maven-hadoop-2.2 #1048 PASSED 2017-10-31 04:50:16 9248 ms amp-jenkins-worker-04 076c2f6a199974a3e30fe349cfc45f375007f081
spark-branch-2.0-test-maven-hadoop-2.2 #1048 PASSED 2017-10-31 04:50:16 9248 ms amp-jenkins-worker-04 076c2f6a199974a3e30fe349cfc45f375007f081
spark-branch-2.0-test-maven-hadoop-2.3 #1048 PASSED 2017-10-31 04:50:16 4215 ms amp-jenkins-worker-03 076c2f6a199974a3e30fe349cfc45f375007f081
spark-branch-2.0-test-maven-hadoop-2.3 #1048 PASSED 2017-10-31 04:50:16 4215 ms amp-jenkins-worker-03 076c2f6a199974a3e30fe349cfc45f375007f081
spark-branch-2.0-test-maven-hadoop-2.3 #1048 PASSED 2017-10-31 04:50:16 4215 ms amp-jenkins-worker-03 076c2f6a199974a3e30fe349cfc45f375007f081
spark-branch-2.0-test-maven-hadoop-2.7 #1069 PASSED 2017-10-31 04:50:16 4174 ms amp-jenkins-worker-07 076c2f6a199974a3e30fe349cfc45f375007f081
spark-branch-2.0-test-maven-hadoop-2.7 #1069 PASSED 2017-10-31 04:50:16 4174 ms amp-jenkins-worker-07 076c2f6a199974a3e30fe349cfc45f375007f081
spark-branch-2.0-test-maven-hadoop-2.7 #1069 PASSED 2017-10-31 04:50:16 4174 ms amp-jenkins-worker-07 076c2f6a199974a3e30fe349cfc45f375007f081
spark-branch-2.0-test-sbt-hadoop-2.4 #1006 PASSED 2017-10-31 04:50:16 3954 ms amp-jenkins-worker-06 076c2f6a199974a3e30fe349cfc45f375007f081
spark-branch-2.0-test-sbt-hadoop-2.4 #1006 PASSED 2017-10-31 04:50:16 3954 ms amp-jenkins-worker-06 076c2f6a199974a3e30fe349cfc45f375007f081
spark-branch-2.0-test-sbt-hadoop-2.4 #1006 PASSED 2017-10-31 04:50:16 3954 ms amp-jenkins-worker-06 076c2f6a199974a3e30fe349cfc45f375007f081
spark-branch-2.0-test-sbt-hadoop-2.2 #984 PASSED 2017-10-31 04:49:11 3571 ms amp-jenkins-worker-02 076c2f6a199974a3e30fe349cfc45f375007f081
spark-branch-2.0-test-sbt-hadoop-2.2 #984 PASSED 2017-10-31 04:49:11 3571 ms amp-jenkins-worker-02 076c2f6a199974a3e30fe349cfc45f375007f081
spark-branch-2.0-test-sbt-hadoop-2.2 #984 PASSED 2017-10-31 04:49:11 3571 ms amp-jenkins-worker-02 076c2f6a199974a3e30fe349cfc45f375007f081
spark-branch-2.0-test-maven-hadoop-2.6 #1042 PASSED 2017-10-31 04:48:11 8157 ms amp-jenkins-worker-04 076c2f6a199974a3e30fe349cfc45f375007f081
spark-branch-2.0-test-maven-hadoop-2.6 #1042 PASSED 2017-10-31 04:48:11 8157 ms amp-jenkins-worker-04 076c2f6a199974a3e30fe349cfc45f375007f081
spark-branch-2.0-test-maven-hadoop-2.6 #1042 PASSED 2017-10-31 04:48:11 8157 ms amp-jenkins-worker-04 076c2f6a199974a3e30fe349cfc45f375007f081
spark-branch-2.0-test-sbt-hadoop-2.6 #990 PASSED 2017-10-31 04:48:11 3546 ms amp-jenkins-worker-07 076c2f6a199974a3e30fe349cfc45f375007f081

Latest failures

Build Status Start time Duration Executor Revision Logs
spark-master-test-maven-hadoop-2.7 #2572 FAILED 2017-02-09 18:11:14 4162053 ms amp-jenkins-worker-03 4064574d031215fcfdf899a1ee9f3b6fecb1bfc9
spark-master-test-maven-hadoop-2.7 #2571 FAILED 2017-02-09 13:47:08 268148 ms amp-jenkins-worker-05 3fc8e8caf81d0049daf9b776ad4059b0df81630f
spark-master-test-maven-hadoop-2.7 #2570 REGRESSION 2017-02-09 11:21:13 350430 ms amp-jenkins-worker-05 1a09cd634610329e85ff212c71cf67c697da5f84
spark-master-test-maven-hadoop-2.7 #2567 FAILED 2017-02-09 00:32:17 222045 ms amp-jenkins-worker-03 c618ccdbe9ac103dfa3182346e2a14a1e7fca91a
spark-master-test-maven-hadoop-2.6 #2616 FAILED 2017-02-08 19:52:46 2501422 ms amp-jenkins-worker-06 1aeb9f6cba07a52d76e5a52b13b474f5552e5f34
spark-branch-2.1-test-maven-hadoop-2.6 #372 REGRESSION 2017-02-08 19:36:12 142065 ms amp-jenkins-worker-07 502c927b8c8a99ef2adf4e6e1d7a6d9232d45ef5
spark-master-test-maven-hadoop-2.6 #2615 FAILED 2017-02-08 17:30:16 185334 ms amp-jenkins-worker-06 15627ac7435f97bb71d6f8645c75a06a8b2b2388
spark-branch-2.1-test-maven-hadoop-2.7 #360 REGRESSION 2017-02-07 22:46:15 100084 ms amp-jenkins-worker-06 e642a07d57798f98b25ba08ed7ae3abe0f597941
spark-branch-2.1-test-maven-hadoop-2.6 #366 FAILED 2017-02-07 11:45:15 166781 ms amp-jenkins-worker-06 dd1abef138581f30ab7a8dfacb616fe7dd64b421
spark-branch-2.1-test-maven-hadoop-2.7 #358 FAILED 2017-02-07 05:05:13 125433 ms amp-jenkins-worker-08 62fab5beee147c90d8b7f8092b4ee76ba611ee8e
spark-branch-2.1-test-maven-hadoop-2.6 #364 REGRESSION 2017-02-06 20:31:14 155193 ms amp-jenkins-worker-03 f55bd4c736b01f1fe3df0ca2f4582c8d2b4d77f9
spark-branch-2.1-test-maven-hadoop-2.7 #355 FAILED 2017-02-01 21:01:14 229046 ms amp-jenkins-worker-08 f946464155bb907482dc8d8a1b0964a925d04081
spark-branch-2.1-test-maven-hadoop-2.7 #353 FAILED 2017-02-01 01:15:14 99831 ms amp-jenkins-worker-03 d35a1268d784a268e6137eff54eb8f83c981a289
spark-master-test-maven-hadoop-2.6 #2559 FAILED 2017-01-31 02:41:13 299706 ms amp-jenkins-worker-07 f9156d2956a8e751720bf63071c504a3e86f267d
spark-master-test-maven-hadoop-2.6 #2558 FAILED 2017-01-30 22:11:11 269069 ms amp-jenkins-worker-03 c0eda7e87fe06c5ec8d146829e25f3627f18c529
spark-master-test-maven-hadoop-2.7 #2509 REGRESSION 2017-01-30 22:11:11 164849 ms amp-jenkins-worker-07 c0eda7e87fe06c5ec8d146829e25f3627f18c529
spark-master-test-maven-hadoop-2.6 #2557 FAILED 2017-01-30 17:05:16 94516 ms amp-jenkins-worker-02 06fbc3554952bc9ba376b070a4a8f8a81be742fa
spark-master-test-maven-hadoop-2.6 #2556 REGRESSION 2017-01-29 23:12:55 337196 ms amp-jenkins-worker-08 ade075aed483cdfc71bdbe8da912679771cef49c
spark-master-test-maven-hadoop-2.7 #2507 REGRESSION 2017-01-29 23:11:45 223621 ms amp-jenkins-worker-03 ade075aed483cdfc71bdbe8da912679771cef49c
spark-master-test-maven-hadoop-2.7 #2504 FAILED 2017-01-28 21:36:15 283680 ms amp-jenkins-worker-04 cfcfc92f7bbdfd3a8b5e3948ae2f95c74d470434
spark-branch-2.1-test-maven-hadoop-2.7 #349 FAILED 2017-01-27 22:07:12 104915 ms amp-jenkins-worker-07 9a49f9afa7fcf2f968914ac81d13e27db3451491
spark-branch-2.1-test-maven-hadoop-2.6 #354 FAILED 2017-01-27 18:36:11 190781 ms amp-jenkins-worker-05 4002ee97dfd67a6305d062705df8f539cdbc8ac8
spark-master-test-maven-hadoop-2.6 #2543 REGRESSION 2017-01-27 04:16:14 312917 ms amp-jenkins-worker-04 1191fe267d2faad2a99a83f3375ce2d9d382cfa0
spark-branch-2.1-test-maven-hadoop-2.7 #346 FAILED 2017-01-27 00:56:10 101646 ms amp-jenkins-worker-03 59502bbcf6e64e5b5e3dda080441054afaf58c53
spark-master-test-maven-hadoop-2.7 #2495 FAILED 2017-01-26 17:56:13 950798 ms amp-jenkins-worker-04 9f523d3192c71a728fd8a2a64f52bbc337f2f026